TP-Link ac600 Archer T2UH

Las partes físicas de tu maquina funcionando bajo linux (Tarjeta de video, de sonido, modem, tarjeta de red, monitor, etc.)

Moderador: doc

Responder
Odios
Forista Nuevo
Forista Nuevo
Mensajes: 2
Registrado: Jue Mar 09, 2017 12:50 pm

TP-Link ac600 Archer T2UH

Mensaje por Odios »

Buenas,soy nuevo por linux y estoy utilizando ubuntu 16 ...

Estoy intentado instalar los drivers de este usb wifi,y siguiendo los pasos de esta web,me da algun error que no logro comprender ...
Este es el enlace por donde he mirado para instalar los drivers:

https://salmorejogeek.com/2015/08/18/tp ... -funcionan...

Y creo que el error esta en el paso de make:
tolkio@tolkio-System-Product-Name:~/src/mt7610u_wifi_sta_v3002_dpo_20130916$ make
make -C tools
make[1]: se entra en el directorio '/home/tolkio/src/mt7610u_wifi_sta_v3002_dpo_20130916/tools'
gcc -g bin2h.c -o bin2h
make[1]: se sale del directorio '/home/tolkio/src/mt7610u_wifi_sta_v3002_dpo_20130916/tools'
/home/tolkio/src/mt7610u_wifi_sta_v3002_dpo_20130916/tools/bin2h
chipset = mt7610u
cp -f os/linux/Makefile.6 /home/tolkio/src/mt7610u_wifi_sta_v3002_dpo_20130916/os/linux/Makefile
make -C /lib/modules/4.8.0-41-generic/build SUBDIRS=/home/tolkio/src/mt7610u_wifi_sta_v3002_dpo_20130916/os/linux modules
make[1]: se entra en el directorio '/usr/src/linux-headers-4.8.0-41-generic'
CC [M] /home/tolkio/src/mt7610u_wifi_sta_v3002_dpo_20130916/os/linux/../../os/linux/rt_profile.o
In file included from /home/tolkio/src/mt7610u_wifi_sta_v3002_dpo_20130916/include/rtmp_os.h:44:0,
from /home/tolkio/src/mt7610u_wifi_sta_v3002_dpo_20130916/include/rtmp_comm.h:75,
from /home/tolkio/src/mt7610u_wifi_sta_v3002_dpo_20130916/include/rt_config.h:33,
from /home/tolkio/src/mt7610u_wifi_sta_v3002_dpo_20130916/os/linux/../../os/linux/rt_profile.c:28:
/home/tolkio/src/mt7610u_wifi_sta_v3002_dpo_20130916/include/os/rt_linux.h:77:0: warning: "EXT_BUILD_CHANNEL_LIST" redefined
#define EXT_BUILD_CHANNEL_LIST /* must define with CRDA */
^
:0:0: note: this is the location of the previous definition
In file included from /home/tolkio/src/mt7610u_wifi_sta_v3002_dpo_20130916/include/os/rt_linux.h:98:0,
from /home/tolkio/src/mt7610u_wifi_sta_v3002_dpo_20130916/include/rtmp_os.h:44,
from /home/tolkio/src/mt7610u_wifi_sta_v3002_dpo_20130916/include/rtmp_comm.h:75,
from /home/tolkio/src/mt7610u_wifi_sta_v3002_dpo_20130916/include/rt_config.h:33,
from /home/tolkio/src/mt7610u_wifi_sta_v3002_dpo_20130916/os/linux/../../os/linux/rt_profile.c:28:
/home/tolkio/src/mt7610u_wifi_sta_v3002_dpo_20130916/include/cfg80211.h:35:49: error: ‘IEEE80211_NUM_BANDS’ undeclared here (not in a function)
struct ieee80211_supported_band Cfg80211_bands[IEEE80211_NUM_BANDS];
^
/home/tolkio/src/mt7610u_wifi_sta_v3002_dpo_20130916/os/linux/../../os/linux/rt_profile.c: In function ‘announce_802_3_packet’:
/home/tolkio/src/mt7610u_wifi_sta_v3002_dpo_20130916/os/linux/../../os/linux/rt_profile.c:341:16: warning: unused variable ‘pAd’ [-Wunused-variable]
RTMP_ADAPTER *pAd = (RTMP_ADAPTER *)pAdSrc;
^
In file included from /home/tolkio/src/mt7610u_wifi_sta_v3002_dpo_20130916/include/rtmp_os.h:44:0,
from /home/tolkio/src/mt7610u_wifi_sta_v3002_dpo_20130916/include/rtmp_comm.h:75,
from /home/tolkio/src/mt7610u_wifi_sta_v3002_dpo_20130916/include/rt_config.h:33,
from /home/tolkio/src/mt7610u_wifi_sta_v3002_dpo_20130916/os/linux/../../os/linux/rt_profile.c:28:
/home/tolkio/src/mt7610u_wifi_sta_v3002_dpo_20130916/os/linux/../../os/linux/rt_profile.c: In function ‘STA_MonPktSend’:
/home/tolkio/src/mt7610u_wifi_sta_v3002_dpo_20130916/os/linux/../../os/linux/rt_profile.c:450:35: warning: format ‘%d’ expects argument of type ‘int’, but argument 3 has type ‘long unsigned int’ [-Wformat=]
DBGPRINT(RT_DEBUG_ERROR, ("%s : Size is too large! (%d)\n", __FUNCTION_
^
/home/tolkio/src/mt7610u_wifi_sta_v3002_dpo_20130916/include/os/rt_linux.h:669:16: note: in definition of macro ‘DBGPRINT_RAW’
printk Fmt; \
^
/home/tolkio/src/mt7610u_wifi_sta_v3002_dpo_20130916/os/linux/../../os/linux/rt_profile.c:450:9: note: in expansion of macro ‘DBGPRINT’
DBGPRINT(RT_DEBUG_ERROR, ("%s : Size is too large! (%d)\n", __FUNCTION_
^
scripts/Makefile.build:289: fallo en las instrucciones para el objetivo '/home/tolkio/src/mt7610u_wifi_sta_v3002_dpo_20130916/os/linux/../../os/linux/rt_profile.o'
make[2]: *** [/home/tolkio/src/mt7610u_wifi_sta_v3002_dpo_20130916/os/linux/../../os/linux/rt_profile.o] Error 1
Makefile:1491: fallo en las instrucciones para el objetivo '_module_/home/tolkio/src/mt7610u_wifi_sta_v3002_dpo_20130916/os/linux'
make[1]: *** [_module_/home/tolkio/src/mt7610u_wifi_sta_v3002_dpo_20130916/os/linux] Error 2
make[1]: se sale del directorio '/usr/src/linux-headers-4.8.0-41-generic'
Makefile:403: fallo en las instrucciones para el objetivo 'LINUX'
make: *** [LINUX] Error 2
Alguna solucion? Muchas gracias de antemano !

Avatar de Usuario
doc
Forista Ancestral
Forista Ancestral
Mensajes: 3477
Registrado: Mié Ago 11, 2010 10:32 am
Ubicación: Oviedo-es_ES
Contactar:

Re: TP-Link ac600 Archer T2UH

Mensaje por doc »

no se, asumo que te has descargado un archivo específico para instalar ese usb-wifi, pero, cuando me tocó hacerlo, a mi me parece que lo hacía mucho más fácil en otro chisme, también Tp-Link, con su famoso chipset, similar.
Mira aquí: http://comoserdebianitaynomorirenelinte ... ipset.html
a ver si te sirve de algo.

Responder
  • Temas similares
    Respuestas
    Vistas
    Último mensaje